Target
Casein kinase I isoform gamma-2
Ligand
BDBM50400751
Substrate
Meas. Tech.
ChEMBL_880536 (CHEMBL2211471)
IC50
50±n/a nM
Citation
 Huang, HAcquaviva, LBerry, VBregman, HChakka, NDiMauro, EFDovey, JEpstein, OGrubinska, BGoldstein, JGunaydin, HHua, ZHuang, XHuang, LHuman, JLong, ANewcomb, JPatel, VFSaffran, DSerafino, RSchneider, SStrathdee, CTang, JTurci, SWhite, RYu, VZhao, HWilson, CMartin, MW Structure-Based Design of Potent and Selective CK1¿ Inhibitors. ACS Med Chem Lett 3:1059-1064 (2012)  
Target
Name:
Casein kinase I isoform gamma-2
Synonyms:
CK1G2 Casein kinase I KC1G2_HUMAN
Type:
PROTEIN
Mol. Mass.:
47475.36
Organism:
Homo sapiens (Human)
Description:
ChEMBL_774313
Residue:
415
  
Inhibitor
Name:
BDBM50400751
Synonyms:
CHEMBL2203553
Type:
Small organic molecule
Emp. Form.:
C20H17FN4O2
Mol. Mass.:
364.373
SMILES:
COc1cnc(\C=C\c2ccc(F)cc2)nc1-c1cc2c(CCNC2=O)[nH]1
: