Target
Casein kinase I isoform gamma-2
Ligand
BDBM50400754
Substrate
Meas. Tech.
ChEMBL_880522 (CHEMBL2211457)
IC50
537±n/a nM
Citation
 Huang, HAcquaviva, LBerry, VBregman, HChakka, NDiMauro, EFDovey, JEpstein, OGrubinska, BGoldstein, JGunaydin, HHua, ZHuang, XHuang, LHuman, JLong, ANewcomb, JPatel, VFSaffran, DSerafino, RSchneider, SStrathdee, CTang, JTurci, SWhite, RYu, VZhao, HWilson, CMartin, MW Structure-Based Design of Potent and Selective CK1¿ Inhibitors. ACS Med Chem Lett 3:1059-1064 (2012)  
Target
Name:
Casein kinase I isoform gamma-2
Synonyms:
CK1G2 Casein kinase I KC1G2_HUMAN
Type:
PROTEIN
Mol. Mass.:
47475.36
Organism:
Homo sapiens (Human)
Description:
ChEMBL_774313
Residue:
415
  
Inhibitor
Name:
BDBM50400754
Synonyms:
CHEMBL2203564
Type:
Small organic molecule
Emp. Form.:
C21H20FN3O3
Mol. Mass.:
381.4002
SMILES:
COc1cnc(COc2ccc(F)cc2C)cc1-c1cc2c(CCNC2=O)[nH]1
: