Target
Glycogen synthase kinase-3 beta
Ligand
BDBM50400756
Substrate
Meas. Tech.
ChEMBL_880533 (CHEMBL2211468)
IC50
4000±n/a nM
Citation
 Huang, HAcquaviva, LBerry, VBregman, HChakka, NDiMauro, EFDovey, JEpstein, OGrubinska, BGoldstein, JGunaydin, HHua, ZHuang, XHuang, LHuman, JLong, ANewcomb, JPatel, VFSaffran, DSerafino, RSchneider, SStrathdee, CTang, JTurci, SWhite, RYu, VZhao, HWilson, CMartin, MW Structure-Based Design of Potent and Selective CK1¿ Inhibitors. ACS Med Chem Lett 3:1059-1064 (2012)  
Target
Name:
Glycogen synthase kinase-3 beta
Synonyms:
GSK-3 beta GSK3B Glycogen synthase kinase 3 beta (GSK3B) Glycogen synthase kinase-3 beta (GSK-3B) Glycogen synthase kinase-3 beta (GSK3B) Glycogen synthase kinase-3beta (GSK3B) | Serine/threonine-protein kinase GSK3B
Type:
Enzyme
Mol. Mass.:
46756.38
Organism:
Homo sapiens (Human)
Description:
P49841
Residue:
420
  
Inhibitor
Name:
BDBM50400756
Synonyms:
CHEMBL2203562
Type:
Small organic molecule
Emp. Form.:
C20H17F2N3O3
Mol. Mass.:
385.3641
SMILES:
COc1cnc(COc2ccc(F)cc2F)cc1-c1cc2c(CCNC2=O)[nH]1
: