Target
Casein kinase I isoform delta
Ligand
BDBM50400747
Substrate
Meas. Tech.
ChEMBL_880535 (CHEMBL2211470)
IC50
168±n/a nM
Citation
 Huang, HAcquaviva, LBerry, VBregman, HChakka, NDiMauro, EFDovey, JEpstein, OGrubinska, BGoldstein, JGunaydin, HHua, ZHuang, XHuang, LHuman, JLong, ANewcomb, JPatel, VFSaffran, DSerafino, RSchneider, SStrathdee, CTang, JTurci, SWhite, RYu, VZhao, HWilson, CMartin, MW Structure-Based Design of Potent and Selective CK1¿ Inhibitors. ACS Med Chem Lett 3:1059-1064 (2012)  
Target
Name:
Casein kinase I isoform delta
Synonyms:
CKI-delta CSNK1D Casein kinase I delta Casein kinase I isoform delta (CK1D) KC1D_HUMAN | casein kinases 1 delta (CK1 delta)
Type:
Enzyme
Mol. Mass.:
47356.76
Organism:
Homo sapiens (Human)
Description:
P48730
Residue:
415
  
Inhibitor
Name:
BDBM50400747
Synonyms:
CHEMBL2203557
Type:
Small organic molecule
Emp. Form.:
C19H17FN4O3
Mol. Mass.:
368.3617
SMILES:
COc1cnc(OCc2ccc(F)cc2)nc1-c1cc2c(CCNC2=O)[nH]1
: