Target
Histone-lysine N-methyltransferase 2A
Ligand
BDBM50400778
Substrate
Meas. Tech.
ChEMBL_879143 (CHEMBL2209114)
IC50
>100000±n/a nM
Citation
 Verma, SKTian, XLaFrance, LVDuquenne, CSuarez, DPNewlander, KARomeril, SPBurgess, JLGrant, SWBrackley, JAGraves, APScherzer, DAShu, AThompson, COtt, HMAller, GSMachutta, CADiaz, EJiang, YJohnson, NWKnight, SDKruger, RGMcCabe, MTDhanak, DTummino, PJCreasy, CLMiller, WH Identification of Potent, Selective, Cell-Active Inhibitors of the Histone Lysine Methyltransferase EZH2. ACS Med Chem Lett 3:1091-1096 (2012)  
Target
Name:
Histone-lysine N-methyltransferase 2A
Synonyms:
ALL-1 ALL1 CXXC-type zinc finger protein 7 HRX Histone-lysine N-methyltransferase 2A KMT2A_HUMAN MLL MLL cleavage product N320 Myeloid/lymphoid or mixed-lineage leukemia Myeloid/lymphoid or mixed-lineage leukemia protein 1 TRX1 Zinc finger protein HRX p320
Type:
Protein
Mol. Mass.:
431905.67
Organism:
Homo sapiens (Human)
Description:
Q03164
Residue:
3969
  
Inhibitor
Name:
BDBM50400778
Synonyms:
CHEMBL2204995
Type:
Small organic molecule
Emp. Form.:
C31H39N7O2
Mol. Mass.:
541.6871
SMILES:
CCCc1cc(C)[nH]c(=O)c1CNC(=O)c1cc(cc2n(ncc12)C(C)C)-c1ccnc(c1)N1CCN(C)CC1
: