Target
DNA topoisomerase 2-alpha
Ligand
BDBM50400785
Substrate
Meas. Tech.
ChEMBL_879173 (CHEMBL2209144)
IC50
4600±n/a nM
Citation
 Ríos, JLAndújar, IRecio, MCGiner, RM Lanostanoids from fungi: a group of potential anticancer compounds. J Nat Prod 75:2016-2044 (2012)  
Target
Name:
DNA topoisomerase 2-alpha
Synonyms:
DNA topoisomerase 2-alpha DNA topoisomerase II (Topo II) DNA topoisomerase II, alpha isozyme TOP2A Topoisomerase I/II | Topoisomerase II alpha (HuTopoIIα)
Type:
Protein
Mol. Mass.:
174415.30
Organism:
Homo sapiens (Human)
Description:
P11388
Residue:
1531
  
Inhibitor
Name:
BDBM50400785
Synonyms:
CHEMBL449350
Type:
Small organic molecule
Emp. Form.:
C31H46O3
Mol. Mass.:
466.6951
SMILES:
CC(C)C(=C)CCC([C@H]1CC[C@@]2(C)C3=CC[C@H]4C(C)(C)C(=O)CC[C@]4(C)C3=CC[C@]12C)C(O)=O
: