Target
4-aminobutyrate aminotransferase, mitochondrial
Ligand
BDBM50082127
Substrate
Meas. Tech.
ChEMBL_879272 (CHEMBL2208625)
Ki
6300000±n/a nM
Citation
 Meanwell, NA Synopsis of some recent tactical application of bioisosteres in drug design. J Med Chem 54:2529-91 (2011)  
Target
Name:
4-aminobutyrate aminotransferase, mitochondrial
Synonyms:
(S)-3-amino-2-methylpropionate transaminase ABAT GABA transaminase GABA-T GABT_HUMAN L-AIBAT
Type:
PROTEIN
Mol. Mass.:
56449.39
Organism:
Homo sapiens (Human)
Description:
ChEMBL_1459248
Residue:
500
  
Inhibitor
Name:
BDBM50082127
Synonyms:
3-(ammoniomethyl)-2,6-difluorobenzenolate CHEMBL321931
Type:
Small organic molecule
Emp. Form.:
C7H7F2NO
Mol. Mass.:
159.1334
SMILES:
[NH3+]Cc1ccc(F)c([O-])c1F
: