Target
5-hydroxytryptamine receptor 1A
Ligand
BDBM50400893
Substrate
Meas. Tech.
ChEMBL_880264 (CHEMBL2215842)
Ki
68±n/a nM
Citation
 Bang-Andersen, BRuhland, TJørgensen, MSmith, GFrederiksen, KJensen, KGZhong, HNielsen, SMHogg, SMørk, AStensbøl, TB Discovery of 1-[2-(2,4-dimethylphenylsulfanyl)phenyl]piperazine (Lu AA21004): a novel multimodal compound for the treatment of major depressive disorder. J Med Chem 54:3206-21 (2011)  
Target
Name:
5-hydroxytryptamine receptor 1A
Synonyms:
5-HT-1A 5-hydroxytryptamine receptor 1A (5-HT-1A) ADRB2RL1 Dopamine D2 receptor and serotonin 1a receptor HTR1A | Serotonin receptor 1A
Type:
Mol. Mass.:
46122.49
Organism:
Homo sapiens (Human)
Description:
Residue:
422
  
Inhibitor
Name:
BDBM50400893
Synonyms:
CHEMBL2205053
Type:
Small organic molecule
Emp. Form.:
C16H16Cl2N2S
Mol. Mass.:
339.283
SMILES:
Clc1ccc(Sc2ccccc2N2CCNCC2)cc1Cl
: