Target
Protein phosphatase methylesterase 1
Ligand
BDBM50400986
Substrate
Meas. Tech.
ChEMBL_879621 (CHEMBL2209153)
IC50
600±n/a nM
Citation
 Bachovchin, DAZuhl, AMSpeers, AEWolfe, MRWeerapana, EBrown, SJRosen, HCravatt, BF Discovery and optimization of sulfonyl acrylonitriles as selective, covalent inhibitors of protein phosphatase methylesterase-1. J Med Chem 54:5229-36 (2011)  
Target
Name:
Protein phosphatase methylesterase 1
Synonyms:
PME-1 Pme1 | Ppme1
Type:
PROTEIN
Mol. Mass.:
42251.88
Organism:
Mus musculus
Description:
ChEMBL_879621
Residue:
386
  
Inhibitor
Name:
BDBM50400986
Synonyms:
CHEMBL1550905
Type:
Small organic molecule
Emp. Form.:
C19H12FN3O6S2
Mol. Mass.:
461.443
SMILES:
[O-][N+](=O)c1cccc(c1)S(=O)(=O)n1cccc1\C=C(/C#N)S(=O)(=O)c1ccc(F)cc1
: