Target
Protein phosphatase methylesterase 1
Ligand
BDBM50400993
Substrate
Meas. Tech.
ChEMBL_879621 (CHEMBL2209153)
IC50
4000±n/a nM
Citation
 Bachovchin, DAZuhl, AMSpeers, AEWolfe, MRWeerapana, EBrown, SJRosen, HCravatt, BF Discovery and optimization of sulfonyl acrylonitriles as selective, covalent inhibitors of protein phosphatase methylesterase-1. J Med Chem 54:5229-36 (2011)  
Target
Name:
Protein phosphatase methylesterase 1
Synonyms:
PME-1 Pme1 | Ppme1
Type:
PROTEIN
Mol. Mass.:
42251.88
Organism:
Mus musculus
Description:
ChEMBL_879621
Residue:
386
  
Inhibitor
Name:
BDBM50400993
Synonyms:
CHEMBL1729870
Type:
Small organic molecule
Emp. Form.:
C15H11N3O4S2
Mol. Mass.:
361.396
SMILES:
CS(=O)(=O)C(=C\c1cccn1S(=O)(=O)c1ccc(cc1)C#N)\C#N
: