Target
Sodium-dependent serotonin transporter
Ligand
BDBM50296249
Substrate
Meas. Tech.
ChEMBL_879501 (CHEMBL2208899)
IC50
239.77±n/a nM
Citation
 Riss, PJHooker, JMShea, CXu, YCarter, PWarner, DFerrari, VKim, SWAigbirhio, FIFowler, JSRoesch, F Characterisation of [¹¹C]PR04.MZ in Papio anubis baboon: a selective high-affinity radioligand for quantitative imaging of the dopamine transporter. Bioorg Med Chem Lett 22:679-82 (2011)  
Target
Name:
Sodium-dependent serotonin transporter
Synonyms:
5-HT Transporter 5HTT SC6A4_HUMAN SLC6A4 Serotonin transporter (5HTT) Sodium-dependent serotonin transporter (SERT) | Solute carrier family 6 member 4
Type:
Multi-pass membrane protein
Mol. Mass.:
70322.51
Organism:
Homo sapiens (Human)
Description:
P31645
Residue:
630
  
Inhibitor
Name:
BDBM50296249
Synonyms:
(1R,2S,3S,5S)-methyl 8-(4-fluorobut-2-ynyl)-3-p-tolyl-8-azabicyclo[3.2.1]octane-2-carboxylate | CHEMBL562115
Type:
Small organic molecule
Emp. Form.:
C20H24FNO2
Mol. Mass.:
329.4085
SMILES:
COC(=O)[C@@H]1[C@H]2CC[C@@H](C[C@@H]1c1ccc(C)cc1)N2CC#CCF
: