Target
4-aminobutyrate aminotransferase, mitochondrial
Ligand
BDBM50118886
Substrate
Meas. Tech.
ChEMBL_884620 (CHEMBL2214167)
Ki
3200000±n/a nM
Citation
 Pan, YGerasimov, MRKvist, TWellendorph, PMadsen, KKPera, ELee, HSchousboe, AChebib, MBräuner-Osborne, HCraft, CMBrodie, JDSchiffer, WKDewey, SLMiller, SRSilverman, RB (1S, 3S)-3-amino-4-difluoromethylenyl-1-cyclopentanoic acid (CPP-115), a potent¿-aminobutyric acid aminotransferase inactivator for the treatment of cocaine addiction. J Med Chem 55:357-66 (2012)  
Target
Name:
4-aminobutyrate aminotransferase, mitochondrial
Synonyms:
(S)-3-amino-2-methylpropionate transaminase ABAT GABA transaminase GABA-T GABT_HUMAN L-AIBAT
Type:
PROTEIN
Mol. Mass.:
56449.39
Organism:
Homo sapiens (Human)
Description:
ChEMBL_1459248
Residue:
500
  
Inhibitor
Name:
BDBM50118886
Synonyms:
4-Amino-hex-5-enoic acid US10189807, (S)-vigabatrin | VIGABATRIN
Type:
Small organic molecule
Emp. Form.:
C6H11NO2
Mol. Mass.:
129.157
SMILES:
NC(CCC(O)=O)C=C
: