Target
Beta-galactoside-binding lectin
Ligand
BDBM50401020
Substrate
Meas. Tech.
ChEMBL_884641 (CHEMBL2214657)
IC50
1300000±n/a nM
Citation
 André, SJarikote, DVYan, DVincenz, LWang, GNKaltner, HMurphy, PVGabius, HJ Synthesis of bivalent lactosides and their activity as sensors for differences between lectins in inter- and intrafamily comparisons. Bioorg Med Chem Lett 22:313-8 (2011)  
Target
Name:
Beta-galactoside-binding lectin
Synonyms:
14 kDa lectin CG-1B LEG4_CHICK
Type:
PROTEIN
Mol. Mass.:
15064.98
Organism:
Gallus gallus
Description:
ChEMBL_884641
Residue:
135
  
Inhibitor
Name:
BDBM50401020
Synonyms:
CHEMBL2203664
Type:
Small organic molecule
Emp. Form.:
C28H46N2O22
Mol. Mass.:
762.665
SMILES:
OC[C@H]1O[C@@H](O[C@H]2[C@H](O)[C@@H](O)[C@H](NC(=O)\C=C\C(=O)N[C@@H]3O[C@H](CO)[C@@H](O[C@@H]4O[C@H](CO)[C@H](O)[C@H](O)[C@H]4O)[C@H](O)[C@H]3O)O[C@@H]2CO)[C@H](O)[C@@H](O)[C@H]1O
: