Target
Beta-galactoside-binding lectin
Ligand
BDBM50401023
Substrate
Meas. Tech.
ChEMBL_884646 (CHEMBL2214662)
IC50
6700000±n/a nM
Citation
 André, SJarikote, DVYan, DVincenz, LWang, GNKaltner, HMurphy, PVGabius, HJ Synthesis of bivalent lactosides and their activity as sensors for differences between lectins in inter- and intrafamily comparisons. Bioorg Med Chem Lett 22:313-8 (2011)  
Target
Name:
Beta-galactoside-binding lectin
Synonyms:
14 kDa lectin CG-1B LEG4_CHICK
Type:
PROTEIN
Mol. Mass.:
15064.98
Organism:
Gallus gallus
Description:
ChEMBL_884641
Residue:
135
  
Inhibitor
Name:
BDBM50401023
Synonyms:
CHEMBL2203663
Type:
Small organic molecule
Emp. Form.:
C82H102N8O30
Mol. Mass.:
1679.7229
SMILES:
OC[C@H]1O[C@@H](O[C@@H]2[C@@H](CO)O[C@H]([C@H](O)[C@H]2O)n2cc(CO[C@H]3[C@H](OCc4ccccc4)[C@@H](OCc4ccccc4)[C@H]4C\C=C\C[C@@H]5O[C@H]([C@H](OCc6cn(nn6)[C@@H]6O[C@H](CO)[C@@H](O[C@@H]7O[C@H](CO)[C@H](O)[C@H](O)[C@H]7O)[C@H](O)[C@H]6O)[C@@H](OCc6ccccc6)[C@@H]5OCc5ccccc5)C(=O)NCc5ccc(CNC(=O)[C@H]3O4)cc5)nn2)[C@H](O)[C@@H](O)[C@H]1O
: