Target
Hypoxia-inducible factor 1-alpha
Ligand
BDBM50315537
Substrate
Meas. Tech.
ChEMBL_881928 (CHEMBL2212531)
IC50
40±n/a nM
Citation
 Xia, YChoi, HKLee, K Recent advances in hypoxia-inducible factor (HIF)-1 inhibitors. Eur J Med Chem 49:24-40 (2012)  
Target
Name:
Hypoxia-inducible factor 1-alpha
Synonyms:
BHLHE78 HIF-1-alpha, HIF-2-alpha HIF1A_HUMAN Hypoxia-inducible factor 1 alpha MOP1 von Hippel-Lindau disease tumor suppressor/Elongin-C/Elongin-B/HIF1A
Type:
Protein
Mol. Mass.:
92647.24
Organism:
Homo sapiens (Human)
Description:
Q16665
Residue:
826
  
Inhibitor
Name:
BDBM50315537
Synonyms:
CHEMBL1089316 | chaetocin
Type:
Small organic molecule
Emp. Form.:
C30H28N6O6S4
Mol. Mass.:
696.84
SMILES:
CN1C(=O)[C@@]23C[C@]4([C@H](Nc5ccccc45)N2C(=O)[C@]1(CO)SS3)[C@]12C[C@]34SS[C@](CO)(N(C)C3=O)C(=O)N4[C@H]1Nc1ccccc21
: