Target
Hypoxia-inducible factor 1-alpha
Ligand
BDBM50401029
Substrate
Meas. Tech.
ChEMBL_881925 (CHEMBL2212528)
IC50
3±n/a nM
Citation
 Xia, YChoi, HKLee, K Recent advances in hypoxia-inducible factor (HIF)-1 inhibitors. Eur J Med Chem 49:24-40 (2012)  
Target
Name:
Hypoxia-inducible factor 1-alpha
Synonyms:
BHLHE78 HIF-1-alpha, HIF-2-alpha HIF1A_HUMAN Hypoxia-inducible factor 1 alpha MOP1 von Hippel-Lindau disease tumor suppressor/Elongin-C/Elongin-B/HIF1A
Type:
Protein
Mol. Mass.:
92647.24
Organism:
Homo sapiens (Human)
Description:
Q16665
Residue:
826
  
Inhibitor
Name:
BDBM50401029
Synonyms:
CHEMBL2205734
Type:
Small organic molecule
Emp. Form.:
C25H21ClN4
Mol. Mass.:
412.914
SMILES:
Cc1cc(nn1Cc1ccc(C)cc1)-c1nc2cc(ccc2[nH]1)-c1ccc(Cl)cc1
: