Target
Muscarinic acetylcholine receptor M1
Ligand
BDBM50241132
Substrate
Meas. Tech.
ChEMBL_882197 (CHEMBL2215470)
Ki
0.17±n/a nM
Citation
 Daval, SBValant, CBonnet, DKellenberger, EHibert, MGalzi, JLIlien, B Fluorescent derivatives of AC-42 to probe bitopic orthosteric/allosteric binding mechanisms on muscarinic M1 receptors. J Med Chem 55:2125-43 (2012)  
Target
Name:
Muscarinic acetylcholine receptor M1
Synonyms:
ACM1_HUMAN Cholinergic receptor, muscarinic 1 | Cholinergic, muscarinic M1
Type:
Protein
Mol. Mass.:
51442.54
Organism:
Homo sapiens (Human)
Description:
P11229
Residue:
460
  
Inhibitor
Name:
BDBM50241132
Synonyms:
3-Hydroxy-2-phenyl-propionic acid 9-methyl-3-oxa-9-aza-tricyclo[3.3.1.0*2,4*]non-7-yl ester CHEMBL376897 Methyl scopolamine | N-METHYLSCOPOLAMINE
Type:
Small organic molecule
Emp. Form.:
C18H24NO4
Mol. Mass.:
318.3869
SMILES:
C[N+]1(C)[C@H]2C[C@@H](C[C@@H]1[C@H]1O[C@@H]21)OC(=O)[C@H](CO)c1ccccc1
: