Target
Substance-P receptor
Ligand
BDBM50401083
Substrate
Meas. Tech.
ChEMBL_883639 (CHEMBL2210304)
Ki
0.7±n/a nM
Citation
 Bissantz, CBohnert, CHoffmann, TMarcuz, ASchnider, PMalherbe, P Identification of a crucial amino acid in the helix position 6.51 of human tachykinin neurokinin 1 and 3 receptors contributing to the insurmountable mode of antagonism by dual NK1/NK3 antagonists. J Med Chem 55:5061-76 (2012)  
Target
Name:
Substance-P receptor
Synonyms:
NK-1 receptor NK1 Receptor NK1R_HUMAN Neurokinin-1 (NK-1) SPR TACR1 Tachykinin receptor 1 (NK1) | tachykinin
Type:
G Protein-Coupled Receptor (GPCR)
Mol. Mass.:
46254.43
Organism:
Homo sapiens (Human)
Description:
P25103
Residue:
407
  
Inhibitor
Name:
BDBM50401083
Synonyms:
CHEMBL2203703
Type:
Small organic molecule
Emp. Form.:
C30H30F7N3O3
Mol. Mass.:
613.5663
SMILES:
CN(C(=O)C(C)(C)c1cc(cc(c1)C(F)(F)F)C(F)(F)F)c1cnc(cc1-c1ccc(F)cc1C)N1CC[C@H](O)[C@H]1CO
: