Target
Urokinase plasminogen activator surface receptor
Ligand
BDBM50401175
Substrate
Meas. Tech.
ChEMBL_881708 (CHEMBL2209754)
IC50
30000±n/a nM
Citation
 Wang, FEric Knabe, WLi, LJo, IMani, TRoehm, HOh, KLi, JKhanna, MMeroueh, SO Design, synthesis, biochemical studies, cellular characterization, and structure-based computational studies of small molecules targeting the urokinase receptor. Bioorg Med Chem 20:4760-73 (2012)  
Target
Name:
Urokinase plasminogen activator surface receptor
Synonyms:
CD_antigen=CD87 Monocyte activation antigen Mo3 U-PAR UPAR_HUMAN Urokinase receptor (uPAR) | Urokinase-type plasminogen activator/surface receptor
Type:
Receptor
Mol. Mass.:
36979.14
Organism:
Homo sapiens (Human)
Description:
Q03405
Residue:
335
  
Inhibitor
Name:
BDBM50401175
Synonyms:
CHEMBL2206363
Type:
Small organic molecule
Emp. Form.:
C28H18BrNO5
Mol. Mass.:
528.35
SMILES:
OC(=O)c1cccc(Nc2cc(Br)c(OCc3ccccc3)c3C(=O)c4ccccc4C(=O)c23)c1
: