Target
Urokinase plasminogen activator surface receptor
Ligand
BDBM50401183
Substrate
Meas. Tech.
ChEMBL_881708 (CHEMBL2209754)
IC50
51000±n/a nM
Citation
 Wang, FEric Knabe, WLi, LJo, IMani, TRoehm, HOh, KLi, JKhanna, MMeroueh, SO Design, synthesis, biochemical studies, cellular characterization, and structure-based computational studies of small molecules targeting the urokinase receptor. Bioorg Med Chem 20:4760-73 (2012)  
Target
Name:
Urokinase plasminogen activator surface receptor
Synonyms:
CD_antigen=CD87 Monocyte activation antigen Mo3 U-PAR UPAR_HUMAN Urokinase receptor (uPAR) | Urokinase-type plasminogen activator/surface receptor
Type:
Receptor
Mol. Mass.:
36979.14
Organism:
Homo sapiens (Human)
Description:
Q03405
Residue:
335
  
Inhibitor
Name:
BDBM50401183
Synonyms:
CHEMBL2206351
Type:
Small organic molecule
Emp. Form.:
C25H25N3O6
Mol. Mass.:
463.4825
SMILES:
CCOC(=O)C1CCCN(C1)c1cc(NCCC(O)=O)c2C(=O)c3ccccc3-c3onc1c23
: