Target
Trace amine-associated receptor 1
Ligand
BDBM50401206
Substrate
Meas. Tech.
ChEMBL_882009 (CHEMBL2213071)
Ki
84±n/a nM
Citation
 Galley, GStalder, HGoergler, AHoener, MCNorcross, RD Optimisation of imidazole compounds as selective TAAR1 agonists: discovery of RO5073012. Bioorg Med Chem Lett 22:5244-8 (2012)  
Target
Name:
Trace amine-associated receptor 1
Synonyms:
TA1 TAAR1_HUMAN TRAR1 | trace amine-associated receptor 1
Type:
PROTEIN
Mol. Mass.:
39107.47
Organism:
Homo sapiens (Human)
Description:
ChEMBL_792734
Residue:
339
  
Inhibitor
Name:
BDBM50401206
Synonyms:
CHEMBL2206390
Type:
Small organic molecule
Emp. Form.:
C11H15N5O
Mol. Mass.:
233.2697
SMILES:
CCN(Cc1cnc[nH]1)c1nccc(OC)n1
: