Target
Vascular endothelial growth factor receptor 2
Ligand
BDBM50401286
Substrate
Meas. Tech.
ChEMBL_883085 (CHEMBL2210729)
IC50
64±n/a nM
Citation
 Hirose, MOkaniwa, MMiyazaki, TImada, TOhashi, TTanaka, YArita, TYabuki, MKawamoto, TTsutsumi, SSumita, ATakagi, TSang, BCYano, JAertgeerts, KYoshida, SIshikawa, T Design and synthesis of novel DFG-out RAF/vascular endothelial growth factor receptor 2 (VEGFR2) inhibitors: 3. Evaluation of 5-amino-linked thiazolo[5,4-d]pyrimidine and thiazolo[5,4-b]pyridine derivatives. Bioorg Med Chem 20:5600-15 (2012)  
Target
Name:
Vascular endothelial growth factor receptor 2
Synonyms:
CD_antigen=CD309 Fetal liver kinase 1 (FLK-1) KDR Protein-tyrosine kinase receptor Flk-1 VEGFR-2 VEGFR2 Vascular Endothelial Growth Factor Receptor Kinase 2 Vascular endothelial growth factor receptor 2 (KDR) Vascular endothelial growth factor receptor 2 (VEGFR2) Vascular endothelial growth factor receptor-2 (VEGFR-2)
Type:
Receptor Tyrosine Kinase
Mol. Mass.:
151510.97
Organism:
Homo sapiens (Human)
Description:
P35968
Residue:
1356
  
Inhibitor
Name:
BDBM50401286
Synonyms:
CHEMBL2204533
Type:
Small organic molecule
Emp. Form.:
C27H22ClFN6O3S
Mol. Mass.:
565.018
SMILES:
CC(C)(Oc1cccc(C(=O)Nc2cc(Nc3ccc4nc(NC(=O)C5CC5)sc4n3)ccc2F)c1Cl)C#N
: