Target
C-C chemokine receptor type 8
Ligand
BDBM50092158
Substrate
Meas. Tech.
ChEMBL_884037 (CHEMBL2215086)
EC50
3981.07±n/a nM
Citation
 Thiele, SMalmgaard-Clausen, MEngel-Andreasen, JSteen, ARummel, PCNielsen, MCGloriam, DEFrimurer, TMUlven, TRosenkilde, MM Modulation in selectivity and allosteric properties of small-molecule ligands for CC-chemokine receptors. J Med Chem 55:8164-77 (2012)  
Target
Name:
C-C chemokine receptor type 8
Synonyms:
CCR8 CKRL1 CMKBRL2
Type:
PROTEIN
Mol. Mass.:
40855.53
Organism:
Homo sapiens (Human)
Description:
ChEMBL_454278
Residue:
355
  
Inhibitor
Name:
BDBM50092158
Synonyms:
1,10-phenanthroline US10669227, Compound 1,10-phenanthroline US9187406, 1,10-phenanthroline | cid_1318
Type:
Small organic molecule
Emp. Form.:
C12H8N2
Mol. Mass.:
180.2053
SMILES:
c1cnc2c(c1)ccc1cccnc21
: