Target
Muscarinic acetylcholine receptor M3
Ligand
BDBM50401359
Substrate
Meas. Tech.
ChEMBL_884093 (CHEMBL2215569)
Ki
209±n/a nM
Citation
 Banister, SDManoli, MDoddareddy, MRHibbs, DEKassiou, M As(1) receptor pharmacophore derived from a series of N-substituted 4-azahexacyclo[5.4.1.0(2,6).0(3,10).0(5,9).0(8,11)]dodecan-3-ols (AHDs). Bioorg Med Chem Lett 22:6053-8 (2012)  
Target
Name:
Muscarinic acetylcholine receptor M3
Synonyms:
ACM3_HUMAN Cholinergic, muscarinic M3 Muscarinic receptor M3 | RecName: Full=Muscarinic acetylcholine receptor M3
Type:
Enzyme
Mol. Mass.:
66151.03
Organism:
Homo sapiens (Human)
Description:
P20309
Residue:
590
  
Inhibitor
Name:
BDBM50401359
Synonyms:
CHEMBL2205816
Type:
Small organic molecule
Emp. Form.:
C18H20N2O
Mol. Mass.:
280.3642
SMILES:
OC12C3C4C5C3C(C3C5CC4C13)N2CCc1ccccn1
: