Target
Kappa-type opioid receptor
Ligand
BDBM50401363
Substrate
Meas. Tech.
ChEMBL_884082 (CHEMBL2215558)
Ki
1147±n/a nM
Citation
 Banister, SDManoli, MDoddareddy, MRHibbs, DEKassiou, M As(1) receptor pharmacophore derived from a series of N-substituted 4-azahexacyclo[5.4.1.0(2,6).0(3,10).0(5,9).0(8,11)]dodecan-3-ols (AHDs). Bioorg Med Chem Lett 22:6053-8 (2012)  
Target
Name:
Kappa-type opioid receptor
Synonyms:
K-OR-1 Kappa-opioid receptor (KOR) Kappa-type opioid receptor (KOR) OPIATE Kappa OPRK1 kappa opioid receptor (KOR)
Type:
G Protein-Coupled Receptor (GPCR)
Mol. Mass.:
42648.76
Organism:
Homo sapiens (Human)
Description:
P41145
Residue:
380
  
Inhibitor
Name:
BDBM50401363
Synonyms:
CHEMBL2205827
Type:
Small organic molecule
Emp. Form.:
C20H23NO3
Mol. Mass.:
325.4015
SMILES:
COc1ccc(CN2C3C4C5C6C4C2(O)C2C6CC5C32)cc1OC
: