Target
Histamine H1 receptor
Ligand
BDBM50401361
Substrate
Meas. Tech.
ChEMBL_884323 (CHEMBL2210356)
Ki
8858±n/a nM
Citation
 Banister, SDManoli, MDoddareddy, MRHibbs, DEKassiou, M As(1) receptor pharmacophore derived from a series of N-substituted 4-azahexacyclo[5.4.1.0(2,6).0(3,10).0(5,9).0(8,11)]dodecan-3-ols (AHDs). Bioorg Med Chem Lett 22:6053-8 (2012)  
Target
Name:
Histamine H1 receptor
Synonyms:
H1R HISTAMINE H1 HRH1_HUMAN
Type:
G Protein-Coupled Receptor (GPCR)
Mol. Mass.:
55808.72
Organism:
Homo sapiens (Human)
Description:
Cell pellets from SK-N-MC cells transfected with human H1 receptor were used in binding assay.
Residue:
487
  
Inhibitor
Name:
BDBM50401361
Synonyms:
CHEMBL2205811
Type:
Small organic molecule
Emp. Form.:
C20H23NO2
Mol. Mass.:
309.4021
SMILES:
COc1cccc(CCN2C3C4C5C6C4C2(O)C2C6CC5C32)c1
: