Target
Neuraminidase
Ligand
BDBM50401401
Substrate
Meas. Tech.
ChEMBL_881601 (CHEMBL2215924)
IC50
0.09±n/a nM
Citation
 Cheng, TJWeinheimer, STarbet, EBJan, JTCheng, YSShie, JJChen, CLChen, CAHsieh, WCHuang, PWLin, WHWang, SYFang, JMHu, OYWong, CH Development of oseltamivir phosphonate congeners as anti-influenza agents. J Med Chem 55:8657-70 (2012)  
Target
Name:
Neuraminidase
Synonyms:
NA | NRAM_I33A0
Type:
PROTEIN
Mol. Mass.:
49687.56
Organism:
Influenza A virus (strain A/Wilson-Smith/1933 H1N1) (Influenza A virus(strain A/WS/1933 H1N1))
Description:
ChEMBL_881601
Residue:
453
  
Inhibitor
Name:
BDBM50401401
Synonyms:
CHEMBL2206459
Type:
Small organic molecule
Emp. Form.:
C14H27N4O5P
Mol. Mass.:
362.3617
SMILES:
[#6]-[#6]-[#6](-[#6]-[#6])-[#8]-[#6@@H]-1-[#6]=[#6](-[#6]-[#6@H](\[#7]=[#6](\[#7])-[#7])-[#6@H]-1-[#7]-[#6](-[#6])=O)P([#8])([#8])=O
: