Target
Aurora kinase A
Ligand
BDBM50401448
Substrate
Meas. Tech.
ChEMBL_883357 (CHEMBL2214093)
IC50
4±n/a nM
Citation
 Bavetsias, VCrumpler, SSun, CAvery, SAtrash, BFaisal, AMoore, ASKosmopoulou, MBrown, NSheldrake, PWBush, KHenley, ABox, GValenti, Mde Haven Brandon, ARaynaud, FIWorkman, PEccles, SABayliss, RLinardopoulos, SBlagg, J Optimization of imidazo[4,5-b]pyridine-based kinase inhibitors: identification of a dual FLT3/Aurora kinase inhibitor as an orally bioavailable preclinical development candidate for the treatment of acute myeloid leukemia. J Med Chem 55:8721-34 (2012)  
Target
Name:
Aurora kinase A
Synonyms:
AIK ARK1 AURKA AYK1 Aurora kinase A (AURA) Aurora kinase A (Aurora A) Aurora-related kinase 1 BTAK Breast-tumor-amplified kinase STK15 Serine/threonine kinase 15 Serine/threonine-protein kinase aurora A hARK1
Type:
Serine/threonine-protein kinase
Mol. Mass.:
45830.98
Organism:
Homo sapiens (Human)
Description:
O14965
Residue:
403
  
Inhibitor
Name:
BDBM50401448
Synonyms:
CHEMBL2203764
Type:
Small organic molecule
Emp. Form.:
C22H25ClN8O
Mol. Mass.:
452.94
SMILES:
Cc1cc(CN2CCN(CC2)c2c(Cl)cnc3nc([nH]c23)-c2cn(C)nc2C2CC2)no1
: