Target
Excitatory amino acid transporter 1
Ligand
BDBM50401545
Substrate
Meas. Tech.
ChEMBL_882149 (CHEMBL2214981)
IC50
>316227.77±n/a nM
Citation
 Huynh, THAbrahamsen, BMadsen, KKGonzalez-Franquesa, AJensen, AABunch, L Design, synthesis and pharmacological characterization of coumarin-based fluorescent analogs of excitatory amino acid transporter subtype 1 selective inhibitors, UCPH-101 and UCPH-102. Bioorg Med Chem 20:6831-9 (2012)  
Target
Name:
Excitatory amino acid transporter 1
Synonyms:
EAA1_HUMAN Excitatory Amino Acid EAAT1 GLAST1 | SLC1A3
Type:
Enzyme Catalytic Domain
Mol. Mass.:
59577.19
Organism:
Homo sapiens (Human)
Description:
Excitatory Amino Acid EAAT1 0 HUMAN::P43003
Residue:
542
  
Inhibitor
Name:
BDBM50401545
Synonyms:
CHEMBL2207078
Type:
Small organic molecule
Emp. Form.:
C26H20N2O5
Mol. Mass.:
440.4474
SMILES:
COc1ccc2c(cc(=O)oc2c1)C1C(C#N)C(=N)OC2=C1C(=O)CC(C2)c1ccccc1
: