Target
Neuropeptides B/W receptor type 1
Ligand
BDBM75923
Substrate
Meas. Tech.
ChEMBL_887068 (CHEMBL2213859)
IC50
360±n/a nM
Citation
 Urbano, MGuerrero, MZhao, JVelaparthi, SSaldanha, SAChase, PWang, ZCivelli, OHodder, PSchaeffer, MTBrown, SRosen, HRoberts, E Design, synthesis and SAR analysis of novel potent and selective small molecule antagonists of NPBWR1 (GPR7). Bioorg Med Chem Lett 22:7135-41 (2012)  
Target
Name:
Neuropeptides B/W receptor type 1
Synonyms:
GPR7 NPBWR1 | neuropeptides B/W receptor 1
Type:
Enzyme Catalytic Domain
Mol. Mass.:
36111.82
Organism:
Homo sapiens (Human)
Description:
gi_119607128
Residue:
328
  
Inhibitor
Name:
BDBM75923
Synonyms:
5-chloranyl-4-(4-methoxyphenoxy)-2-naphthalen-1-yl-pyridazin-3-one 5-chloro-4-(4-methoxyphenoxy)-2-(1-naphthyl)pyridazin-3-one SR-02000000453 cid_46835792
Type:
Small organic molecule
Emp. Form.:
C21H15ClN2O3
Mol. Mass.:
378.808
SMILES:
COc1ccc(Oc2c(Cl)cnn(-c3cccc4ccccc34)c2=O)cc1
: