Target
Serine/threonine-protein kinase Chk2
Ligand
BDBM50401617
Substrate
Meas. Tech.
ChEMBL_887301 (CHEMBL2216280)
IC50
3200±n/a nM
Citation
 Lainchbury, MMatthews, TPMcHardy, TBoxall, KJWalton, MIEve, PDHayes, AValenti, MRde Haven Brandon, AKBox, GAherne, GWReader, JCRaynaud, FIEccles, SAGarrett, MDCollins, I Discovery of 3-alkoxyamino-5-(pyridin-2-ylamino)pyrazine-2-carbonitriles as selective, orally bioavailable CHK1 inhibitors. J Med Chem 55:10229-40 (2012)  
Target
Name:
Serine/threonine-protein kinase Chk2
Synonyms:
CDS1 CHK2 Checkpoint Kinase (Chk2) Serine/threonine-protein kinase Chek2 | Serine/threonine-protein kinase Chk1/2
Type:
Protein
Mol. Mass.:
60908.59
Organism:
Homo sapiens (Human)
Description:
O96017
Residue:
543
  
Inhibitor
Name:
BDBM50401617
Synonyms:
CHEMBL2204592 | US9403797, PAPC-A-02
Type:
Small organic molecule
Emp. Form.:
C20H25N9O
Mol. Mass.:
407.4722
SMILES:
CNc1cc(Nc2cnc(C#N)c(O[C@H](C)CN(C)C)n2)ncc1-c1cnn(C)c1
: