Target
5-hydroxytryptamine receptor 3A
Ligand
BDBM50401674
Substrate
Meas. Tech.
ChEMBL_884851 (CHEMBL2209488)
Ki
7612±n/a nM
Citation
 Marriott, KSMorrison, AZMoore, MOlubajo, OStewart, LE Synthesis of N-phenyl-N-(3-(piperidin-1-yl)propyl)benzofuran-2-carboxamides as new selective ligands for sigma receptors. Bioorg Med Chem 20:6856-61 (2012)  
Target
Name:
5-hydroxytryptamine receptor 3A
Synonyms:
5-HT-3 5-HT3A 5-hydroxytryptamine receptor 3 (5-HT3) 5-hydroxytryptamine receptor 3A (5HT3A) 5HT3R HTR3A Serotonin 3 receptor (5HT3) Serotonin-gated ion channel receptor | Serotonin-gated ion channel receptor 3
Type:
Protein
Mol. Mass.:
55283.27
Organism:
Homo sapiens (Human)
Description:
P46098
Residue:
478
  
Inhibitor
Name:
BDBM50401674
Synonyms:
CHEMBL2205362
Type:
Small organic molecule
Emp. Form.:
C26H32N2O4
Mol. Mass.:
436.5433
SMILES:
COc1cc2oc(C(=O)N(CCCN3CCCCC3)c3ccccc3)c(C)c2cc1OC
: