Target
Alpha-2A adrenergic receptor
Ligand
BDBM50401675
Substrate
Meas. Tech.
ChEMBL_884850 (CHEMBL2209487)
Ki
1232±n/a nM
Citation
 Marriott, KSMorrison, AZMoore, MOlubajo, OStewart, LE Synthesis of N-phenyl-N-(3-(piperidin-1-yl)propyl)benzofuran-2-carboxamides as new selective ligands for sigma receptors. Bioorg Med Chem 20:6856-61 (2012)  
Target
Name:
Alpha-2A adrenergic receptor
Synonyms:
ADA2A_HUMAN ADRA2R Adrenergic alpha2A Alpha-2 adrenergic receptor subtype C10 Alpha-2A adrenoreceptor alpha-2A adrenergic receptor [Homo sapiens]
Type:
Enzyme
Mol. Mass.:
48979.91
Organism:
Homo sapiens (Human)
Description:
P08913
Residue:
465
  
Inhibitor
Name:
BDBM50401675
Synonyms:
CHEMBL2205361
Type:
Small organic molecule
Emp. Form.:
C24H28N2O2
Mol. Mass.:
376.4913
SMILES:
Cc1c(oc2ccccc12)C(=O)N(CCCN1CCCCC1)c1ccccc1
: