Target
Sodium-dependent noradrenaline transporter
Ligand
BDBM50401731
Substrate
Meas. Tech.
ChEMBL_885013 (CHEMBL2211273)
Ki
5.8±n/a nM
Citation
 Pechulis, ADBeck, JPCurry, MAWolf, MAHarms, AEXi, NOpalka, CSweet, MPYang, ZVellekoop, ASKlos, AMCrocker, PJHassler, CLaws, MKitchen, DBSmith, MAOlson, RELiu, SMolino, BF 4-Phenyl tetrahydroisoquinolines as dual norepinephrine and dopamine reuptake inhibitors. Bioorg Med Chem Lett 22:7219-22 (2012)  
Target
Name:
Sodium-dependent noradrenaline transporter
Synonyms:
Monoamine transporter NET Noradrenaline Transporter (NET) Norepinephrine transporter protein (NET) SLC6A2 Sodium-dependent noradrenaline transporter (NET) | Solute carrier family 6 member 2
Type:
Multi-pass membrane protein
Mol. Mass.:
69337.72
Organism:
Homo sapiens (Human)
Description:
P23975
Residue:
617
  
Inhibitor
Name:
BDBM50401731
Synonyms:
CHEMBL2206508
Type:
Small organic molecule
Emp. Form.:
C17H17F2N
Mol. Mass.:
273.3204
SMILES:
CN1CC(c2cc(F)cc(F)c2)c2ccc(C)cc2C1
: