Target
Peptidyl-glycine alpha-amidating monooxygenase
Ligand
BDBM50401749
Substrate
Meas. Tech.
ChEMBL_885020 (CHEMBL2211744)
IC50
23000±n/a nM
Citation
 Morris, KMCao, FOnagi, HAltamore, TMGamble, ABEaston, CJ Prohormone-substrate peptide sequence recognition by peptidylglycinea-amidating monooxygenase and its reflection in increased glycolate inhibitor potency. Bioorg Med Chem Lett 22:7015-8 (2012)  
Target
Name:
Peptidyl-glycine alpha-amidating monooxygenase
Synonyms:
AMD_HUMAN PAM Peptidyl-alpha-hydroxyglycine alpha-amidating lyase Peptidylglycine alpha-hydroxylating monooxygenase
Type:
PROTEIN
Mol. Mass.:
108328.29
Organism:
Homo sapiens (Human)
Description:
ChEMBL_885021
Residue:
973
  
Inhibitor
Name:
BDBM50401749
Synonyms:
CHEMBL2207130
Type:
Small organic molecule
Emp. Form.:
C52H73N11O15S2
Mol. Mass.:
1156.331
SMILES:
CC[C@H](C)[C@@H]1NC(=O)[C@H](Cc2ccc(O)cc2)NC(=O)[C@@H](N)CSSC[C@H](NC(=O)[C@H](CC(N)=O)NC(=O)[C@H](CCC(N)=O)NC1=O)C(=O)N1CCC[C@H]1C(=O)N[C@@H](CC(C)C)C(=O)N[C@@H](Cc1ccccc1)C(=O)OCC(O)=O
: