Target
Peptidyl-glycine alpha-amidating monooxygenase
Ligand
BDBM50401755
Substrate
Meas. Tech.
ChEMBL_885020 (CHEMBL2211744)
IC50
500000±n/a nM
Citation
 Morris, KMCao, FOnagi, HAltamore, TMGamble, ABEaston, CJ Prohormone-substrate peptide sequence recognition by peptidylglycinea-amidating monooxygenase and its reflection in increased glycolate inhibitor potency. Bioorg Med Chem Lett 22:7015-8 (2012)  
Target
Name:
Peptidyl-glycine alpha-amidating monooxygenase
Synonyms:
AMD_HUMAN PAM Peptidyl-alpha-hydroxyglycine alpha-amidating lyase Peptidylglycine alpha-hydroxylating monooxygenase
Type:
PROTEIN
Mol. Mass.:
108328.29
Organism:
Homo sapiens (Human)
Description:
ChEMBL_885021
Residue:
973
  
Inhibitor
Name:
BDBM50401755
Synonyms:
CHEMBL2207144
Type:
Small organic molecule
Emp. Form.:
C7H11NO4
Mol. Mass.:
173.1665
SMILES:
OC(=O)COC(=O)[C@@H]1CCCN1
: