Target
Peptidyl-glycine alpha-amidating monooxygenase
Ligand
BDBM50401750
Substrate
Meas. Tech.
ChEMBL_885021 (CHEMBL2211745)
IC50
6000±n/a nM
Citation
 Morris, KMCao, FOnagi, HAltamore, TMGamble, ABEaston, CJ Prohormone-substrate peptide sequence recognition by peptidylglycinea-amidating monooxygenase and its reflection in increased glycolate inhibitor potency. Bioorg Med Chem Lett 22:7015-8 (2012)  
Target
Name:
Peptidyl-glycine alpha-amidating monooxygenase
Synonyms:
AMD_HUMAN PAM Peptidyl-alpha-hydroxyglycine alpha-amidating lyase Peptidylglycine alpha-hydroxylating monooxygenase
Type:
PROTEIN
Mol. Mass.:
108328.29
Organism:
Homo sapiens (Human)
Description:
ChEMBL_885021
Residue:
973
  
Inhibitor
Name:
BDBM50401750
Synonyms:
CHEMBL2207129
Type:
Small organic molecule
Emp. Form.:
C24H33N3O7
Mol. Mass.:
475.5347
SMILES:
CC(C)C[C@H](NC(=O)[C@@H]1CCCN1C(C)=O)C(=O)N[C@@H](Cc1ccccc1)C(=O)OCC(O)=O
: