Target
Histone deacetylase 1
Ligand
BDBM19149
Substrate
Meas. Tech.
ChEMBL_885569 (CHEMBL2210427)
IC50
96±n/a nM
Citation
 Choi, SEPflum, MK The structural requirements of histone deacetylase inhibitors: suberoylanilide hydroxamic acid analogs modified at the C6 position. Bioorg Med Chem Lett 22:7084-6 (2012)  
Target
Name:
Histone deacetylase 1
Synonyms:
Cereblon/Histone deacetylase 1 HDAC1 Histone deacetylase 1 (HDAC1) RPD3L1
Type:
Enzyme
Mol. Mass.:
55090.27
Organism:
Homo sapiens (Human)
Description:
Q13547
Residue:
482
  
Inhibitor
Name:
BDBM19149
Synonyms:
CHEMBL98 SAHA US10188756, Compound SAHA US11505523, Compound SAHA US9353061, SAHA US9695181, Vorinostat Zolinza suberoylanilide hydroxamic acid
Type:
Small organic molecule
Emp. Form.:
C14H20N2O3
Mol. Mass.:
264.3202
SMILES:
ONC(=O)CCCCCCC(=O)Nc1ccccc1
: