Target
Serine/threonine-protein kinase TBK1
Ligand
BDBM50401911
Substrate
Meas. Tech.
ChEMBL_886439 (CHEMBL2213811)
IC50
7±n/a nM
Citation
 McIver, EGBryans, JBirchall, KChugh, JDrake, TLewis, SJOsborne, JSmiljanic-Hurley, ETsang, WKamal, ALevy, ANewman, MTaylor, DArthur, JSClark, KCohen, P Synthesis and structure-activity relationships of a novel series of pyrimidines as potent inhibitors of TBK1/IKKe kinases. Bioorg Med Chem Lett 22:7169-73 (2012)  
Target
Name:
Serine/threonine-protein kinase TBK1
Synonyms:
NAK Protein cereblon/Serine/threonine-protein kinase TBK1 TANK-binding kinase 1 (TBK-1) TBK1 | TBK1_HUMAN
Type:
protein
Mol. Mass.:
83645.20
Organism:
Homo sapiens (Human)
Description:
Q9UHD2
Residue:
729
  
Inhibitor
Name:
BDBM50401911
Synonyms:
CHEMBL2207216
Type:
Small organic molecule
Emp. Form.:
C26H40N8O
Mol. Mass.:
480.6488
SMILES:
CC(C)N1CCC(CC1)n1cc(Nc2ncc(C3CC3)c(NCCCNC(=O)C3CCC3)n2)cn1
: