Target
Serine/threonine-protein kinase TBK1
Ligand
BDBM50401927
Substrate
Meas. Tech.
ChEMBL_886439 (CHEMBL2213811)
IC50
3±n/a nM
Citation
 McIver, EGBryans, JBirchall, KChugh, JDrake, TLewis, SJOsborne, JSmiljanic-Hurley, ETsang, WKamal, ALevy, ANewman, MTaylor, DArthur, JSClark, KCohen, P Synthesis and structure-activity relationships of a novel series of pyrimidines as potent inhibitors of TBK1/IKKe kinases. Bioorg Med Chem Lett 22:7169-73 (2012)  
Target
Name:
Serine/threonine-protein kinase TBK1
Synonyms:
NAK Protein cereblon/Serine/threonine-protein kinase TBK1 TANK-binding kinase 1 (TBK-1) TBK1 | TBK1_HUMAN
Type:
protein
Mol. Mass.:
83645.20
Organism:
Homo sapiens (Human)
Description:
Q9UHD2
Residue:
729
  
Inhibitor
Name:
BDBM50401927
Synonyms:
CHEMBL2207199
Type:
Small organic molecule
Emp. Form.:
C23H28N8O
Mol. Mass.:
432.5214
SMILES:
O=C(NCCCNc1nc(Nc2ccc(cc2)-n2cncn2)ncc1C1CC1)C1CCC1
: