Target
Pancreatic alpha-amylase
Ligand
BDBM50401977
Substrate
Meas. Tech.
ChEMBL_886576 (CHEMBL2215736)
IC50
24390±n/a nM
Citation
 Patil, VSNandre, KPGhosh, SRao, VJChopade, BABhosale, SVBhosale, SV Synthesis and glycosidase inhibitory activity of novel (2-phenyl-4H-benzopyrimedo[2,1-b]-thiazol-4-yliden)acetonitrile derivatives. Bioorg Med Chem Lett 22:7011-4 (2012)  
Target
Name:
Pancreatic alpha-amylase
Synonyms:
1,4-alpha-D-glucan glucanohydrolase AMYP_PIG Pancreatic α-amylase
Type:
Protein
Mol. Mass.:
57088.07
Organism:
Sus scrofa (Pig)
Description:
P00690
Residue:
511
  
Inhibitor
Name:
BDBM50401977
Synonyms:
CHEMBL2207950
Type:
Small organic molecule
Emp. Form.:
C18H10FN3S
Mol. Mass.:
319.356
SMILES:
Fc1ccc(cc1)C1=C\C(=C/C#N)N2C(Sc3ccccc23)=N1
: