Target
Peroxisome proliferator-activated receptor alpha
Ligand
BDBM50099491
Substrate
Meas. Tech.
ChEMBL_886596 (CHEMBL2215756)
EC50
200±n/a nM
Citation
 Giampietro, LD'Angelo, AGiancristofaro, AAmmazzalorso, ADe Filippis, BFantacuzzi, MLinciano, PMaccallini, CAmoroso, R Synthesis and structure-activity relationships of fibrate-based analogues inside PPARs. Bioorg Med Chem Lett 22:7662-6 (2012)  
Target
Name:
Peroxisome proliferator-activated receptor alpha
Synonyms:
NR1C1 PPAR PPAR-alpha PPARA_HUMAN Peroxisome proliferator-activated receptor | Peroxisome proliferator-activated receptor alpha (PPAR alpha)
Type:
Enzyme
Mol. Mass.:
52222.08
Organism:
Homo sapiens (Human)
Description:
Q07869
Residue:
468
  
Inhibitor
Name:
BDBM50099491
Synonyms:
2-(4-(2-(3-cyclohexyl-1-(4-cyclohexylbutyl)ureido)ethyl)phenylthio)-2-methylpropanoic acid CHEMBL21241 cid_3392731
Type:
Small organic molecule
Emp. Form.:
C29H46N2O3S
Mol. Mass.:
502.752
SMILES:
CC(C)(Sc1ccc(CCN(CCCCC2CCCCC2)C(=O)NC2CCCCC2)cc1)C(O)=O
: