Target
Insulin-like growth factor 1 receptor
Ligand
BDBM50402020
Substrate
Meas. Tech.
ChEMBL_886809 (CHEMBL2210500)
Ki
>1800±n/a nM
Citation
 Zhang, QXia, ZMitten, MJLasko, LMKlinghofer, VBouska, JJohnson, EFPenning, TDLuo, YGiranda, VLShoemaker, ARStewart, KDDjuric, SWVasudevan, A Hit to Lead optimization of a novel class of squarate-containing polo-like kinases inhibitors. Bioorg Med Chem Lett 22:7615-22 (2012)  
Target
Name:
Insulin-like growth factor 1 receptor
Synonyms:
CD_antigen=CD221 IGF1R Insulin-like growth factor 1 receptor (IGF1R) Insulin-like growth factor 1 receptor alpha chain Insulin-like growth factor I receptor | Insulin-like growth factor receptor (IGFR)
Type:
Protein
Mol. Mass.:
154776.79
Organism:
Homo sapiens (Human)
Description:
P08069
Residue:
1367
  
Inhibitor
Name:
BDBM50402020
Synonyms:
CHEMBL2205426
Type:
Small organic molecule
Emp. Form.:
C23H22N6O2
Mol. Mass.:
414.4598
SMILES:
CC(C)(C)Nc1c(Nc2ccnc(Nc3ccc(cc3)-c3ccncc3)n2)c(=O)c1=O
: