Target
Serine/threonine-protein kinase 3
Ligand
BDBM50402020
Substrate
Meas. Tech.
ChEMBL_886740 (CHEMBL2210054)
Ki
2900±n/a nM
Citation
 Zhang, QXia, ZMitten, MJLasko, LMKlinghofer, VBouska, JJohnson, EFPenning, TDLuo, YGiranda, VLShoemaker, ARStewart, KDDjuric, SWVasudevan, A Hit to Lead optimization of a novel class of squarate-containing polo-like kinases inhibitors. Bioorg Med Chem Lett 22:7615-22 (2012)  
Target
Name:
Serine/threonine-protein kinase 3
Synonyms:
KRS1 MST2 STE20-Like Kinase MST2 STK3_HUMAN Serine/threonine-protein kinase 3 (MST2) Serine/threonine-protein kinase Krs-1 | Serine/threonine-protein kinase MST2
Type:
Serine/threonine-protein kinase
Mol. Mass.:
56284.87
Organism:
Homo sapiens (Human)
Description:
Residue:
491
  
Inhibitor
Name:
BDBM50402020
Synonyms:
CHEMBL2205426
Type:
Small organic molecule
Emp. Form.:
C23H22N6O2
Mol. Mass.:
414.4598
SMILES:
CC(C)(C)Nc1c(Nc2ccnc(Nc3ccc(cc3)-c3ccncc3)n2)c(=O)c1=O
: