Target
Tyrosine-protein kinase JAK1
Ligand
BDBM50402076
Substrate
Meas. Tech.
ChEMBL_887157 (CHEMBL2214837)
Ki
1.7±n/a nM
Citation
 Labadie, SDragovich, PSBarrett, KBlair, WSBergeron, PChang, CDeshmukh, GEigenbrot, CGhilardi, NGibbons, PHurley, CAJohnson, AKenny, JRKohli, PBKulagowski, JJLiimatta, MLupardus, PJMendonca, RMurray, JMPulk, RShia, SSteffek, MUbhayakar, SUltsch, Mvan Abbema, AWard, SZak, M Structure-based discovery of C-2 substituted imidazo-pyrrolopyridine JAK1 inhibitors with improved selectivity over JAK2. Bioorg Med Chem Lett 22:7627-33 (2012)  
Target
Name:
Tyrosine-protein kinase JAK1
Synonyms:
JAK-1 JAK1A JAK1_HUMAN Janus kinase 1 (JAK1) | Janus kinase 1 JAK1
Type:
Protein
Mol. Mass.:
133293.73
Organism:
Homo sapiens (Human)
Description:
P23458
Residue:
1154
  
Inhibitor
Name:
BDBM50402076
Synonyms:
CHEMBL2206624
Type:
Small organic molecule
Emp. Form.:
C19H25N7O2S
Mol. Mass.:
415.513
SMILES:
CS(=O)(=O)NCCc1nc2cnc3[nH]ccc3c2n1C1CCN(CCC#N)CC1
: