Target
Kappa-type opioid receptor
Ligand
BDBM50402139
Substrate
Meas. Tech.
ChEMBL_884720 (CHEMBL2215601)
Ki
1.92±n/a nM
Citation
 Fujii, HNakajima, RAkiyama, JYamamoto, NHirayama, SNemoto, TGouda, HHirono, SNagase, H Synthesis of new opioid derivatives with a propellane skeleton and their pharmacologies: part 3, novel propellane derivatives with pentacyclic skeletons. Bioorg Med Chem Lett 22:7697-701 (2012)  
Target
Name:
Kappa-type opioid receptor
Synonyms:
KOR-1 OPIATE Kappa Oprk1
Type:
Enzyme
Mol. Mass.:
42656.78
Organism:
Mus musculus (Mouse)
Description:
P33534
Residue:
380
  
Inhibitor
Name:
BDBM50402139
Synonyms:
CHEMBL2207679
Type:
Small organic molecule
Emp. Form.:
C22H25NO2
Mol. Mass.:
335.4394
SMILES:
Oc1ccc2CC34CC5C=CC3N(CC3CC3)CCC4(CC5=O)c2c1
: