Target
Indoleamine 2,3-dioxygenase 2
Ligand
BDBM50241342
Substrate
Meas. Tech.
ChEMBL_885588 (CHEMBL2210857)
IC50
12600±n/a nM
Citation
 Bakmiwewa, SMFatokun, AATran, APayne, RJHunt, NHBall, HJ Identification of selective inhibitors of indoleamine 2,3-dioxygenase 2. Bioorg Med Chem Lett 22:7641-6 (2012)  
Target
Name:
Indoleamine 2,3-dioxygenase 2
Synonyms:
I23O2_MOUSE Ido2 Indoleamine 2,3-dioxygenase-like protein 1 | Indoleamine-pyrrole 2,3-dioxygenase-like protein 1
Type:
PROTEIN
Mol. Mass.:
45256.34
Organism:
Mus musculus
Description:
ChEMBL_105489
Residue:
405
  
Inhibitor
Name:
BDBM50241342
Synonyms:
5-(difluoromethoxy)-2-((3,4-dimethoxypyridin-2-yl)methylsulfinyl)-1H-benzo[d]imidazole 6-(difluoromethoxy)-2-((3,4-dimethoxypyridin-2-yl)methylsulfinyl)-1H-benzo[d]imidazole CHEMBL1502 Protonix SK-96022
Type:
Small organic molecule
Emp. Form.:
C16H15F2N3O4S
Mol. Mass.:
383.37
SMILES:
COc1ccnc(CS(=O)c2nc3ccc(OC(F)F)cc3[nH]2)c1OC
: