Target
Amine oxidase [flavin-containing] A
Ligand
BDBM50402327
Substrate
Meas. Tech.
ChEMBL_885770 (CHEMBL2213281)
IC50
12000±n/a nM
Citation
 Mostert, SMentz, WPetzer, ABergh, JJPetzer, JP Inhibition of monoamine oxidase by 8-[(phenylethyl)sulfanyl]caffeine analogues. Bioorg Med Chem 20:7040-50 (2012)  
Target
Name:
Amine oxidase [flavin-containing] A
Synonyms:
AOFA_HUMAN MAO-A Monoamine oxidase Monoamine oxidase type A (MAO A) Monoamine oxidase type A (MAOA)
Type:
Protein
Mol. Mass.:
59689.53
Organism:
Homo sapiens (Human)
Description:
P21397
Residue:
527
  
Inhibitor
Name:
BDBM50402327
Synonyms:
CHEMBL2206096
Type:
Small organic molecule
Emp. Form.:
C17H20N4O2S
Mol. Mass.:
344.431
SMILES:
Cc1cccc(CCSc2nc3n(C)c(=O)n(C)c(=O)c3n2C)c1
: