Target
Candidapepsin-2
Ligand
BDBM50402357
Substrate
Meas. Tech.
ChEMBL_885955 (CHEMBL2215717)
IC50
30±n/a nM
Citation
 Calugi, CTrabocchi, ADe Bernardis, FArancia, SNavarra, PCauda, RCassone, AGuarna, A Bicyclic peptidomimetics targeting secreted aspartic protease 2 (SAP2) from Candida albicans reveal a constrained inhibitory chemotype. Bioorg Med Chem 20:7206-13 (2012)  
Target
Name:
Candidapepsin-2
Synonyms:
ACP 2 CARP2_CANAX PRA2 Secreted aspartic protease 2
Type:
PROTEIN
Mol. Mass.:
42313.90
Organism:
Candida albicans
Description:
ChEMBL_885955
Residue:
398
  
Inhibitor
Name:
BDBM50402357
Synonyms:
CHEMBL589301
Type:
Small organic molecule
Emp. Form.:
C18H22N2O4
Mol. Mass.:
330.3783
SMILES:
O=C([C@@H]1O[C@H]2CN(Cc3ccccc3)C(=O)[C@@H]1O2)N1CCCCC1
: