Target
Urokinase plasminogen activator surface receptor
Ligand
BDBM50005397
Substrate
Meas. Tech.
ChEMBL_886136 (CHEMBL2210436)
Ki
0.000±n/a nM
Citation
 Omar, MAShaker, YMGalal, SAAli, MMKerwin, SMLi, JTokuda, HRamadan, RAEl Diwani, HI Synthesis and docking studies of novel antitumor benzimidazoles. Bioorg Med Chem 20:6989-7001 (2012)  
Target
Name:
Urokinase plasminogen activator surface receptor
Synonyms:
CD_antigen=CD87 Monocyte activation antigen Mo3 U-PAR UPAR_HUMAN Urokinase receptor (uPAR) | Urokinase-type plasminogen activator/surface receptor
Type:
Receptor
Mol. Mass.:
36979.14
Organism:
Homo sapiens (Human)
Description:
Q03405
Residue:
335
  
Inhibitor
Name:
BDBM50005397
Synonyms:
CHEMBL2206684
Type:
Small organic molecule
Emp. Form.:
C26H20N6O
Mol. Mass.:
432.4766
SMILES:
C=CCn1c(CN2C3=Nc4ccccc4C(=O)NC3=Nc3ccccc23)nc2ccccc12
: